接続数

COUNTER119949From 2011/5/25

HAZOP diary(安全分析日誌)

HAZOP >> 記事詳細

2017/11/13

man error

Tweet ThisSend to Facebook | by kaizen

mvn

[INFO] Scanning for projects...

[INFO] ------------------------------------------------------------------------

[INFO] BUILD FAILURE

[INFO] ------------------------------------------------------------------------

[INFO] Total time: 0.284 s

[INFO] Finished at: 2017-11-13T08:39:28+09:00

[INFO] Final Memory: 8M/28M

[INFO] ------------------------------------------------------------------------

[ERROR] No goals have been specified for this build. You must specify a valid lifecycle phase or a goal in the format <plugin-prefix>:<goal> or <plugin-group-id>:<plugin-artifact-id>[:<plugin-version>]:<goal>. Available lifecycle phases are: validate, initialize, generate-sources, process-sources, generate-resources, process-resources, compile, process-classes, generate-test-sources, process-test-sources, generate-test-resources, process-test-resources, test-compile, process-test-classes, test, prepare-package, package, pre-integration-test, integration-test, post-integration-test, verify, install, deploy, pre-clean, clean, post-clean, pre-site, site, post-site, site-deploy. -> [Help 1]

[ERROR

[ERROR] To see the full stack trace of the errors, re-run Maven with the -e switch.

[ERROR] Re-run Maven using the -X switch to enable full debug logging.

[ERROR

[ERROR] For more information about the errors and possible solutions, please read the following articles:

[ERROR] [Help 1] http://cwiki.apache.org/confluence/display/MAVEN/NoGoalSpecifiedException



08:40 | 投票する | 投票数(0) | コメント(0)